{"text_format":"1","workbook":"xlsx","n_sheets":4,"sheets":["Answer","PBox","HO","Sheet1"],"not_rendered":{"charts":2,"images":4,"macros":1,"external_links":0,"defined_names":33,"comments":2,"pivot_tables":0},"unopened":[],"bounds":{"document_bytes":16777216,"sheet_cells":100000,"rows_first":2000,"rows_last":500,"rows_between":2000,"halvings":0,"cell_chars":16384,"cell_head_chars":4096},"cells_cut":0,"cells_raw":0,"read":"whole","date_system":"1900"}

{"sheet":"Answer","index":0,"n_rows":28,"n_cols":22,"rows_kept":28,"cut":false,"hidden":false,"merged":[[0,0,0,5],[0,7,0,9],[1,6,1,7],[2,6,2,7],[3,6,3,7],[2,8,2,9],[1,8,1,9],[3,8,3,9],[1,2,1,5],[2,2,2,5],[3,2,3,5],[17,2,17,8],[15,0,15,8],[14,2,14,9],[25,0,25,1],[24,2,24,9],[22,2,22,8],[18,2,18,8],[23,2,23,8],[20,2,20,8],[21,2,21,8],[19,2,19,8],[16,1,16,5],[9,2,9,8],[10,2,10,8],[11,2,11,8],[13,2,13,8],[12,2,12,8],[8,2,8,8],[1,0,1,1],[7,2,7,8],[5,0,5,8],[4,1,4,9],[2,0,2,1],[3,0,3,1]]}
["วิชา 01403342 :: การบ้าน ",null,null,null,null,null,"กลุ่ม",null,null,null,null,null,"std_id=",{"$f":"RIGHT(I2,1)&RIGHT(I3,1)&RIGHT(I4,1)","v":""}]
["ชื่อ-สกุล",null,null,null,null,null,"เลขประจำตัว",null,null,null,"«","nLevel","Bstart","Blength","xStart","xEnd","xPosition","mlevel","yStart","yEnd","yPosition"]
["ชื่อ-สกุล",null,null,null,null,null,"เลขประจำตัว",null,null,null,"¬",{"$f":"MOD(LEN(Name1)+LEN(name2)+LEN(name3),4)+1","v":1},{"$f":"MOD(FIND(\" \",Name1)+FIND(\" \",name2),5)*0.25+0.25","v":{"$error":"#VALUE!"}},{"$f":"6-Bstart-0.25-MOD(STD_ID,4)*0.25","v":{"$error":"#VALUE!"}},{"$f":"Bstart+MOD(LEN(Name1),5/2+0.25)","v":{"$error":"#VALUE!"}},{"$f":"xStart+0.25*MOD(LEN(Name1),6)+0.5","v":{"$error":"#VALUE!"}},{"$f":"ROUND((xStart+xEnd)/2.2,1)","v":{"$error":"#VALUE!"}},{"$f":"MOD(STD_ID*3,4)","v":{"$error":"#VALUE!"}},{"$f":"MOD(STD_ID,5)*-0.25","v":{"$error":"#VALUE!"}},{"$f":"MOD(LEN(Name1),7)*0.25+1.5+yStart","v":{"$error":"#VALUE!"}},{"$f":"ROUND((yStart+yEnd)/1.5,1)","v":{"$error":"#VALUE!"}}]
["ชื่อ-สกุล",null,null,null,null,null,"เลขประจำตัว"]
["คำแนะนำ","1) ต้อง ลงฟอนต์ TH SarabunPSK ในเครื่อง \n2) กรอกชื่อและเลขประจำตัวในหน้า sheet Answer \n3) กรอกข้อมูลที่เกี่ยวข้องลงใน sheet Pbox และ sheet HO โดยกรอกข้อมูลในช่องสีเหลืองและสีส้ม ให้ครบถ้วน \n(ดูให้ละเอียด ทั้งไฟล์)\n    - sheet Pbox เติมข้อมูลในช่องสีส้มก่อน จากนั้นเติมในช่องสีเหลือง (ถ้ายังไม่ทราบอาจลองเติมดูก่อน)\n    - sheet HO เลือกสภาวะที่ต้องการจากปุ่ม เติมข้อมูลในช่องสีเหลือง/ส้ม เท่านั้น \n4) ห้ามแก้ไขช่องอื่นใดที่ไม่ใช่สีเหลือง/ส้ม ห้ามลบ/แทรก ก๊อปปี้ข้อมูล\n5) ตอบคำถามด้านล่างโดยใช้ข้อมูลจาก sheet Pbox และ sheet HO และกรอกข้อมูลในช่องสีเหลืองให้ถูกต้อง\n6) print หน้า sheet Answer, sheet Pbox, sheet HO เป็น pdf file และนำมาส่งตามที่กำหนดในเว็บไซต์ (รวม 4 แผ่น)",null,null,null,null,null,null,null,null,null,{"$f":"IF(AND(ISNUMBER(nLevel),nLevel=PBox!B6),\"x\",\"\")","v":""},null,null,{"$f":"IF(AND(ISNUMBER(xStart),xStart=PAB_xini),\"x\",\"\")","v":{"$error":"#VALUE!"}},{"$f":"IF(AND(ISNUMBER(xEnd),xEnd=PAB_xfin),\"x\",\"\")","v":{"$error":"#VALUE!"}},null,{"$f":"IF(AND(ISNUMBER(HO!B5),mlevel=HO!B5),\"x\",\"\")","v":{"$error":"#VALUE!"}},{"$f":"IF(AND(ISNUMBER(yStart),yStart=HO_xini),\"x\",\"\")","v":{"$error":"#VALUE!"}},{"$f":"IF(AND(ISNUMBER(yEnd),yEnd=HO_xfin),\"x\",\"\")","v":{"$error":"#VALUE!"}}]
["ระบบ Particle in a box",null,null,null,null,null,null,null,null,"คำตอบ","เฉลย",null,null,null,null,null,null,null,null,null,null,{"$f":"COUNTIF(A7:A14,$K$2)+COUNTIF(A17:A24,$K$2)","v":0}]
[{"$f":"IF(nLevel=PBox!B6,$K$2,$K$3)","v":"¬"},{"$f":"\"ถ้าอนุภาคในกล่องอยู่ในสภาวะ n=\"&nLevel","v":"ถ้าอนุภาคในกล่องอยู่ในสภาวะ n=1"}]
[{"$f":"IF(AND(A7=$K$2,L8=\"A\"),$K$2,$K$3)","v":"¬"},null,"จากกราฟ กล่องนี้มีความกว้างเท่าใด",null,null,null,null,null,null,null,{"$f":"Blength","v":{"$error":"#VALUE!"}},{"$f":"IF(LEN(J8)>0,IF(ABS(K8)<0.0000000001,IF(J8=0,\"A\",\"x\"),IF(ABS((J8-K8)/K8)<0.01*ABS(K8),\"A\",\"x\")),\"\")","v":""}]
["¬",null,"จงหาค่า Normalizing Factor ของฟังก์ชันคลื่น",null,null,null,null,null,null,null,{"$f":"1/SQRT(Blength/2)","v":{"$error":"#VALUE!"}},{"$f":"IF(LEN(J9)>0,IF(ABS(K9)<0.0000000001,IF(J9=0,\"A\",\"x\"),IF(ABS((J9-K9)/K9)<0.01*ABS(K9),\"A\",\"x\")),\"\")","v":""}]
["¬",{"$f":"IF(ABS(J10-PBox!F6)>0.0001,\"x\",\"\")","v":{"$error":"#VALUE!"}},"ความน่าจะเป็นที่อนุภาคอยู่ในกล่องเท่ากับ",null,null,null,null,null,null,null,{"$f":"1","v":1},{"$f":"IF(LEN(J10)>0,IF(ABS(K10)<0.0000000001,IF(J10=0,\"A\",\"x\"),IF(ABS((J10-K10)/K10)<0.01*ABS(K10),\"A\",\"x\")),\"\")","v":""}]
["¬",null,{"$f":"\"จงหาค่า ฟังก์ชันคลื่นที่ตำแหน่ง \"&TEXT(Q3,\"0.00\")&\" cm\"","v":{"$error":"#VALUE!"}},null,null,null,null,null,null,null,{"$f":"TEXT(HLOOKUP(PBox!B9,PAB_tab,MATCH(xPosition,PAB_id,1),0),\"0.0000\")","v":{"$error":"#VALUE!"}},""]
["¬",null,{"$f":"\"จงหาค่า ความน่าจะเป็นที่จะพบอนุภาคที่ตำแหน่ง \"&TEXT(Q3,\"0.00\")&\" cm\"","v":{"$error":"#VALUE!"}},null,null,null,null,null,null,null,{"$f":"TEXT(HLOOKUP(PBox!C9,PAB_tab,MATCH(xPosition,PAB_id,1),0),\"0.0000\")","v":{"$error":"#VALUE!"}},""]
["¬",null,"ตำแหน่งที่มีโอกาสพบอนุภาคมากสุดมีความน่าจะเป็นเท่าใด",null,null,null,null,null,null,null,{"$f":"MAX(PABV_p)","v":{"$error":"#VALUE!"}},""]
["¬",null,{"$f":"\"จงหาค่าความน่าจะเป็นที่จะพบอนุภาคในช่วง x= \"&TEXT(O3,\"0.00\")&\" ถึง \"&TEXT(P3,\"0.00\")&\" cm\"","v":{"$error":"#VALUE!"}},null,null,null,null,null,null,null,{"$f":"TEXT(SUMIFS(PABV_p,PABV_x,\">=\"&xStart,PABV_x,\"<=\"&xEnd)*stepsize,\"0.0000\")","v":"0.0000"},""]
[null,null,"เมื่อพิมพ์หน้า Tab Pbox ให้ขีดเส้นแสดงบริเวณที่ต้องการอินทิเกรตในกราฟ",null,null,null,null,null,null,null,null,{"$f":"IF(LEN(J15)>0,IF(K15=0,IF(J15=0,\"A\",\"x\"),IF(ABS((J15-K15)/K15)<0.01*K15,\"A\",\"x\")),\"\")","v":""}]
["ระบบ Harmonic Oscillator",null,null,null,null,null,null,null,null,null,null,{"$f":"IF(LEN(J16)>0,IF(K16=0,IF(J16=0,\"A\",\"x\"),IF(ABS((J16-K16)/K16)<0.01*K16,\"A\",\"x\")),\"\")","v":""}]
[{"$f":"IF(AND(ISNUMBER(HO!B5),mlevel=HO!B5),$K$2,$K$3)","v":{"$error":"#VALUE!"}},"ถ้าอนุภาค Harmonic Oscillator อยู่ในสภาวะ n=",null,null,null,null,{"$f":"mlevel","v":{"$error":"#VALUE!"}},null,null,null,null,{"$f":"IF(LEN(J17)>0,IF(K17=0,IF(J17=0,\"A\",\"x\"),IF(ABS((J17-K17)/K17)<0.01*K17,\"A\",\"x\")),\"\")","v":""}]
[{"$f":"IF(AND(A17=$K$2,L18=\"A\"),$K$2,$K$3)","v":{"$error":"#VALUE!"}},null,"จงหาค่า Normalizing Factor ของฟังก์ชันคลื่น",null,null,null,null,null,null,null,{"$f":"ROUND(HLOOKUP(\"Nfac\",HOv_Ntab,G17+2,1),4)","v":{"$error":"#VALUE!"}},{"$f":"IF(LEN(J18)>0,IF(ABS(K18)<0.0000000001,IF(J18=0,\"A\",\"x\"),IF(ABS((J18-K18)/K18)<0.01*ABS(K18),\"A\",\"x\")),\"\")","v":""}]
[{"$f":"IF(AND(A18=$K$2,L19=\"A\"),$K$2,$K$3)","v":{"$error":"#VALUE!"}},{"$f":"IF(ABS(J19-HO!F5)>0.0001,\"x\",\"\")","v":""},"ความน่าจะเป็นที่อนุภาคบริเวณ x = -4 ถึง 4 cm",null,null,null,null,null,null,null,1,{"$f":"IF(LEN(J19)>0,IF(ABS(K19)<0.0000000001,IF(J19=0,\"A\",\"x\"),IF(ABS((J19-K19)/K19)<0.01*ABS(K19),\"A\",\"x\")),\"\")","v":""}]
[{"$f":"IF(AND(A18=$K$2,L20=\"A\"),$K$2,$K$3)","v":{"$error":"#VALUE!"}},null,"ตำแหน่งที่มีโอกาสพบอนุภาคมากสุดมีความน่าจะเป็นเท่าใด",null,null,null,null,null,null,null,{"$f":"MAX(HOv_P)","v":0},{"$f":"IF(LEN(J20)>0,IF(ABS(K20)<0.0000000001,IF(J20=0,\"A\",\"x\"),IF(ABS((J20-K20)/K20)<0.01*ABS(K20),\"A\",\"x\")),\"\")","v":""}]
[{"$f":"IF(AND(A20=$K$2,L21=\"A\"),$K$2,$K$3)","v":{"$error":"#VALUE!"}},null,"ตำแหน่งที่มีโอกาสพบอนุภาคมากที่สุดคือที่ X เท่ากับเท่าใด (ให้ตอบค่าเดียว)",null,null,null,null,null,null,null,{"$f":"HLOOKUP(\"x\",HOV_Tab,MATCH(K20,HOv_P,0)+1,0)","v":-4},""]
[{"$f":"IF(AND(A21=$K$2,L22=\"A\"),$K$2,$K$3)","v":{"$error":"#VALUE!"}},null,{"$f":"\"จงหาค่า ค่าฟังก์ชันคลื่นที่ตำแหน่ง \"&TEXT(U3,\"0.00\")&\" cm\"","v":{"$error":"#VALUE!"}},null,null,null,null,null,null,null,{"$f":"HLOOKUP(\"Y\",HOV_Tab,MATCH(yPosition,HOv_x,1)+1,0)","v":{"$error":"#VALUE!"}},""]
[{"$f":"IF(AND(A22=$K$2,L23=\"A\"),$K$2,$K$3)","v":{"$error":"#VALUE!"}},null,{"$f":"\"จงหาค่า ความน่าจะเป็นที่จะพบอนุภาคที่ตำแหน่ง \"&TEXT(U3,\"0.00\")&\" cm\"","v":{"$error":"#VALUE!"}},null,null,null,null,null,null,null,{"$f":"HLOOKUP(\"Prob\",HOV_Tab,MATCH(yPosition,HOv_x,1)+1,0)","v":{"$error":"#VALUE!"}},""]
[{"$f":"IF(AND(A23=$K$2,L24=\"A\"),$K$2,$K$3)","v":{"$error":"#VALUE!"}},null,{"$f":"\"จงหาค่าความน่าจะเป็นที่จะพบอนุภาคในช่วง x= \"&TEXT(yStart,\"0.00\")&\" ถึง \"&TEXT(yEnd,\"0.00\")&\" cm\"","v":{"$error":"#VALUE!"}},null,null,null,null,null,null,null,{"$f":"TEXT(SUMIFS(HOv_P,HOv_x,\">=\"&yStart-0.0001,HOv_x,\"<=\"&yEnd)*step_h,\"0.0000\")","v":"0.0000"},""]
[null,null,"เมื่อพิมพ์หน้า Tab HO ให้ขีดเส้นแสดงบริเวณที่ต้องการอินทิเกรตในกราฟ"]
[{"$f":"IF(LEN(J8)>0,\"กำหนดให้\",\"\")","v":""},null,{"$f":"IF(LEN(J8)>0,\"ค่าคงที่ของแก๊สเท่ากับ \"&COUNTIF(L5:U5,\"x\")&\".594\",\"\")","v":""}]
[null,null,{"$f":"IF(COUNT(J8:J14)=7,\"ค่าคงที่ของแพลงค์เท่ากับ \"&COUNTIF(A8:A14,K2)&\".5354\",\"\")","v":""}]
[null,null,{"$f":"IF(COUNT(J18:J24)=7,\"ค่าคงที่ของโบซทมานน์เท่ากับ \"&COUNTIF(A18:A24,K2)&\".089\",\"\")","v":""}]

{"sheet":"PBox","index":1,"n_rows":250,"n_cols":6,"rows_kept":250,"cut":false,"hidden":false,"merged":[[5,2,5,4],[6,2,6,4],[0,0,0,3]]}
["Particle in 1D-Box"]
["Xstart",0]
["Box Length",{"$f":"Blength","v":{"$error":"#VALUE!"}},"BoxStart",{"$f":"Bstart","v":{"$error":"#VALUE!"}},"BoxStop",{"$f":"D3+B3","v":{"$error":"#VALUE!"}}]
["Integrate from",null,"to",null,"Step",2.5000000000000001E-2]
["Flag",1,1,1,null,0]
["n=",null,{"$f":"\"Integrated P (Overall) =\"","v":"Integrated P (Overall) ="},null,null,{"$f":"SUM(PABV_p)*stepsize","v":{"$error":"#VALUE!"}}]
["N=",1,{"$f":"\"Integrated P (\"&TEXT(B4,\"0.00\")&\" - \"&TEXT(D4,\"0.00\")&\") =\"","v":"Integrated P (0.00 - 0.00) ="},null,null,{"$f":"IF(AND(ISNUMBER(PAB_xini),ISNUMBER(PAB_xfin)),SUM(D10:D250),\"\")","v":""}]
["shift",{"$f":"-1*D3","v":{"$error":"#VALUE!"}}]
["X",{"$f":"\"Y\"&B6","v":"Y"},"Prob.","Area","Energy","Range"]
[{"$f":"IF(A9=\"x\",$B$2,ROUND(A9+stepsize,4))","v":0},{"$f":"IF(AND(A10>=$D$3,A10<=$F$3),B$5*(B$7*SIN($B$6*PI()*(A10+$B$8)/$B$3)),0)","v":{"$error":"#VALUE!"}},{"$f":"C$5*((B10)^2)","v":{"$error":"#VALUE!"}},null,{"$f":"0","v":0},{"$f":"IF(F$5=1,IF(AND(A10>=$B$4,A10<=$D$4),C10,0),-5)","v":-5}]
[2.5000000000000001E-2,{"$f":"IF(AND(A11>=$D$3,A11<=$F$3),B$5*(B$7*SIN($B$6*PI()*(A11+$B$8)/$B$3)),0)","v":{"$error":"#VALUE!"}},{"$f":"C$5*((B11)^2)","v":{"$error":"#VALUE!"}},null,{"$f":"0","v":0},{"$f":"IF(F$5=1,IF(AND(A11>=$B$4,A11<=$D$4),C11,0),-5)","v":-5}]
[0.05,{"$error":"#VALUE!"},{"$error":"#VALUE!"},null,{"$f":"0","v":0},-5]
[7.4999999999999997E-2,{"$error":"#VALUE!"},{"$error":"#VALUE!"},null,{"$f":"0","v":0},-5]
[0.1,{"$error":"#VALUE!"},{"$error":"#VALUE!"},null,{"$f":"0","v":0},-5]
[0.125,{"$error":"#VALUE!"},{"$error":"#VALUE!"},null,{"$f":"0","v":0},-5]
[0.15,{"$error":"#VALUE!"},{"$error":"#VALUE!"},null,{"$f":"0","v":0},-5]
[0.17499999999999999,{"$error":"#VALUE!"},{"$error":"#VALUE!"},null,{"$f":"0","v":0},-5]
[0.2,{"$error":"#VALUE!"},{"$error":"#VALUE!"},null,{"$f":"0","v":0},-5]
[0.22500000000000001,{"$error":"#VALUE!"},{"$error":"#VALUE!"},null,{"$f":"0","v":0},-5]
[0.25,{"$error":"#VALUE!"},{"$error":"#VALUE!"},null,{"$f":"0","v":0},-5]
[0.27500000000000002,{"$error":"#VALUE!"},{"$error":"#VALUE!"},null,{"$f":"0","v":0},-5]
[0.3,{"$error":"#VALUE!"},{"$error":"#VALUE!"},null,{"$f":"0","v":0},-5]
[0.32500000000000001,{"$error":"#VALUE!"},{"$error":"#VALUE!"},null,{"$f":"0","v":0},-5]
[0.35,{"$error":"#VALUE!"},{"$error":"#VALUE!"},null,{"$f":"0","v":0},-5]
[0.375,{"$error":"#VALUE!"},{"$error":"#VALUE!"},null,{"$f":"0","v":0},-5]
[0.4,{"$error":"#VALUE!"},{"$error":"#VALUE!"},null,{"$f":"0","v":0},-5]
[0.42499999999999999,{"$error":"#VALUE!"},{"$error":"#VALUE!"},null,{"$f":"0","v":0},-5]
[0.45,{"$error":"#VALUE!"},{"$error":"#VALUE!"},null,{"$f":"0","v":0},-5]
[0.47499999999999998,{"$error":"#VALUE!"},{"$error":"#VALUE!"},null,{"$f":"0","v":0},-5]
[0.5,{"$error":"#VALUE!"},{"$error":"#VALUE!"},null,{"$f":"0","v":0},-5]
[0.52500000000000002,{"$error":"#VALUE!"},{"$error":"#VALUE!"},null,{"$f":"0","v":0},-5]
[0.55000000000000004,{"$error":"#VALUE!"},{"$error":"#VALUE!"},null,{"$f":"0","v":0},-5]
[0.57499999999999996,{"$error":"#VALUE!"},{"$error":"#VALUE!"},null,{"$f":"0","v":0},-5]
[0.6,{"$error":"#VALUE!"},{"$error":"#VALUE!"},null,{"$f":"0","v":0},-5]
[0.625,{"$error":"#VALUE!"},{"$error":"#VALUE!"},null,{"$f":"0","v":0},-5]
[0.65,{"$error":"#VALUE!"},{"$error":"#VALUE!"},null,{"$f":"0","v":0},-5]
[0.67500000000000004,{"$error":"#VALUE!"},{"$error":"#VALUE!"},null,{"$f":"0","v":0},-5]
[0.7,{"$error":"#VALUE!"},{"$error":"#VALUE!"},null,{"$f":"0","v":0},-5]
[0.72499999999999998,{"$error":"#VALUE!"},{"$error":"#VALUE!"},null,{"$f":"0","v":0},-5]
[0.75,{"$error":"#VALUE!"},{"$error":"#VALUE!"},null,{"$f":"0","v":0},-5]
[0.77500000000000002,{"$error":"#VALUE!"},{"$error":"#VALUE!"},null,{"$f":"0","v":0},-5]
[0.8,{"$error":"#VALUE!"},{"$error":"#VALUE!"},null,{"$f":"0","v":0},-5]
[0.82499999999999996,{"$error":"#VALUE!"},{"$error":"#VALUE!"},null,{"$f":"0","v":0},-5]
[0.85,{"$error":"#VALUE!"},{"$error":"#VALUE!"},null,{"$f":"0","v":0},-5]
[0.875,{"$error":"#VALUE!"},{"$error":"#VALUE!"},null,{"$f":"0","v":0},-5]
[0.9,{"$error":"#VALUE!"},{"$error":"#VALUE!"},null,{"$f":"0","v":0},-5]
[0.92500000000000004,{"$error":"#VALUE!"},{"$error":"#VALUE!"},null,{"$f":"0","v":0},-5]
[0.95,{"$error":"#VALUE!"},{"$error":"#VALUE!"},null,{"$f":"0","v":0},-5]
[0.97499999999999998,{"$error":"#VALUE!"},{"$error":"#VALUE!"},null,{"$f":"0","v":0},-5]
[1,{"$error":"#VALUE!"},{"$error":"#VALUE!"},null,{"$f":"0","v":0},-5]
[1.0249999999999999,{"$error":"#VALUE!"},{"$error":"#VALUE!"},null,{"$f":"0","v":0},-5]
[1.05,{"$error":"#VALUE!"},{"$error":"#VALUE!"},null,{"$f":"0","v":0},-5]
[1.075,{"$error":"#VALUE!"},{"$error":"#VALUE!"},null,{"$f":"0","v":0},-5]
[1.1000000000000001,{"$error":"#VALUE!"},{"$error":"#VALUE!"},null,{"$f":"0","v":0},-5]
[1.125,{"$error":"#VALUE!"},{"$error":"#VALUE!"},null,{"$f":"0","v":0},-5]
[1.1499999999999999,{"$error":"#VALUE!"},{"$error":"#VALUE!"},null,{"$f":"0","v":0},-5]
[1.175,{"$error":"#VALUE!"},{"$error":"#VALUE!"},null,{"$f":"0","v":0},-5]
[1.2,{"$error":"#VALUE!"},{"$error":"#VALUE!"},null,{"$f":"0","v":0},-5]
[1.2250000000000001,{"$error":"#VALUE!"},{"$error":"#VALUE!"},null,{"$f":"0","v":0},-5]
[1.25,{"$error":"#VALUE!"},{"$error":"#VALUE!"},null,{"$f":"0","v":0},-5]
[1.2749999999999999,{"$error":"#VALUE!"},{"$error":"#VALUE!"},null,{"$f":"0","v":0},-5]
[1.3,{"$error":"#VALUE!"},{"$error":"#VALUE!"},null,{"$f":"0","v":0},-5]
[1.325,{"$error":"#VALUE!"},{"$error":"#VALUE!"},null,{"$f":"0","v":0},-5]
[1.35,{"$error":"#VALUE!"},{"$error":"#VALUE!"},null,{"$f":"0","v":0},-5]
[1.375,{"$error":"#VALUE!"},{"$error":"#VALUE!"},null,{"$f":"0","v":0},-5]
[1.4,{"$error":"#VALUE!"},{"$error":"#VALUE!"},null,{"$f":"0","v":0},-5]
[1.425,{"$error":"#VALUE!"},{"$error":"#VALUE!"},null,{"$f":"0","v":0},-5]
[1.45,{"$error":"#VALUE!"},{"$error":"#VALUE!"},null,{"$f":"0","v":0},-5]
[1.4750000000000001,{"$error":"#VALUE!"},{"$error":"#VALUE!"},null,{"$f":"0","v":0},-5]
[1.5,{"$error":"#VALUE!"},{"$error":"#VALUE!"},null,{"$f":"0","v":0},-5]
[1.5249999999999999,{"$error":"#VALUE!"},{"$error":"#VALUE!"},null,{"$f":"0","v":0},-5]
[1.55,{"$f":"IF(AND(A72>=$D$3,A72<=$F$3),B$5*(B$7*SIN($B$6*PI()*(A72+$B$8)/$B$3)),0)","v":{"$error":"#VALUE!"}},{"$f":"C$5*((B72)^2)","v":{"$error":"#VALUE!"}},null,{"$f":"0","v":0},{"$f":"IF(F$5=1,IF(AND(A72>=$B$4,A72<=$D$4),C72,0),-5)","v":-5}]
[1.575,{"$error":"#VALUE!"},{"$error":"#VALUE!"},null,{"$f":"0","v":0},-5]
[{"$f":"IF(A73=\"x\",$B$2,ROUND(A73+stepsize,4))","v":1.6},{"$error":"#VALUE!"},{"$error":"#VALUE!"},null,{"$f":"0","v":0},-5]
[1.625,{"$error":"#VALUE!"},{"$error":"#VALUE!"},null,{"$f":"0","v":0},-5]
[1.65,{"$error":"#VALUE!"},{"$error":"#VALUE!"},null,{"$f":"0","v":0},-5]
[1.675,{"$error":"#VALUE!"},{"$error":"#VALUE!"},null,{"$f":"0","v":0},-5]
[1.7,{"$error":"#VALUE!"},{"$error":"#VALUE!"},null,{"$f":"0","v":0},-5]
[1.7250000000000001,{"$error":"#VALUE!"},{"$error":"#VALUE!"},null,{"$f":"0","v":0},-5]
[1.75,{"$error":"#VALUE!"},{"$error":"#VALUE!"},null,{"$f":"0","v":0},-5]
{"$rows_left_out":171}
{"sheet":"HO","index":2,"n_rows":330,"n_cols":24,"rows_kept":330,"cut":false,"hidden":false,"merged":[[4,2,4,4],[5,2,5,4],[0,0,0,4],[0,5,0,16]]}
["Harmonic Oscillator",null,null,null,null,"เลือกสภาวะที่ต้องการโดยกดปุ่ม และเติมค่าในช่องสีเหลืองเท่านั้น"]
["Xstart",-4,"Step",2.5000000000000001E-2]
["Box Center",0,"k =",2,"a=",0.8]
["Integrate from",null,"to",null,"Efactor=",4.5,null,null,null,null,null,null,null,null,null,null,null,null,null,null,null,null,"x"]
["n=",3,"Integrated Overall P =",null,null,{"$f":"SUM(D10:D330)*step_h","v":0},null,null,null,null,null,null,null,null,null,null,null,null,null,"n","formula","N","Nfac"]
["N=",null,{"$f":"\"Integrated P(x=\"&TEXT(B4,\"0.00\")&\" to \"& TEXT(D4,\"0.00\")&\") =\"","v":"Integrated P(x=0.00 to 0.00) ="},null,null,{"$f":"IF(AND(ISNUMBER(HO_xini),ISNUMBER(HO_xfin)),SUM(E10:E330),\"\")","v":""},null,null,null,null,null,null,null,null,null,null,null,null,null,0,{"$f":"B$6*EXP(-1*(($A10+$B$7)/$F$3)^2/2)","v":0},{"$f":"IF($W$4=\"x\",1,$W$6)","v":1},{"$f":"1/SQRT($F$3*SQRT(PI())*2^$T6*FACT($T6))","v":0.83978388853007613},{"$f":"1/SQRT($F$3*SQRT(PI())*2^$T6*FACT($T6))","v":0.83978388853007613}]
["shift",{"$f":"-1*B3","v":0},null,null,null,null,null,null,null,null,null,null,null,null,null,null,null,null,null,1,{"$f":"$B$6*(2*($A10+$B$7)/$F$3)*EXP(-1*(($A10+$B$7)/$F$3)^2/2)","v":0},{"$f":"IF($W$4=\"x\",1,$W$7)","v":1},{"$f":"1/SQRT($F$3*SQRT(PI())*2^$T7*FACT($T7))","v":0.59381688231082452},0.59381688231082452]
["Flag",1,1,1,null,null,null,null,null,null,null,null,null,null,null,null,null,null,null,2,{"$f":"$B$6*(4*($A10+$B$7)^2/$F$3^2-2)*EXP(-1*(($A10+$B$7)/$F$3)^2/2)","v":0},{"$f":"IF($W$4=\"x\",1,$W$8)","v":1},0.29690844115541226,0.29690844115541226]
["X","V","Y","Prob","Area","E1",null,null,null,null,null,null,null,null,null,null,null,null,null,3,{"$f":"$B$6*(8*($A10+$B$7)^3/$F$3^3-12*($A10+$B$7)/$F$3)*EXP(-1*(($A10+$B$7)/$F$3)^2/2)","v":0},{"$f":"IF($W$4=\"x\",1,$W$9)","v":1},0.12121236352598752,0.12121236352598752]
[{"$f":"IF(A9=\"x\",$B$2,A9+step_h)","v":-4},{"$f":"$B$8*($D$3*(A10-$B$3)^2-($B$5+0.5)*$F$4)","v":16.25},{"$f":"$B$6*(8*($A10+$B$7)^3/$F$3^3-12*($A10+$B$7)/$F$3)*EXP(-1*(($A10+$B$7)/$F$3)^2/2)","v":0},{"$f":"D$8*((C10)^2)","v":0},null,0]
[-3.9750000000000001,{"$f":"$B$8*($D$3*(A11-$B$3)^2-($B$5+0.5)*$F$4)","v":15.85125},{"$f":"$B$6*(8*($A11+$B$7)^3/$F$3^3-12*($A11+$B$7)/$F$3)*EXP(-1*(($A11+$B$7)/$F$3)^2/2)","v":0},0,null,0]
[-3.95,15.455000000000002,0,0,null,0]
[-3.9250000000000003,15.061250000000005,0,0,null,0]
[-3.9000000000000004,14.670000000000005,0,0,null,0]
[-3.8750000000000004,14.281250000000007,0,0,null,0]
[-3.8500000000000005,13.895000000000007,0,0,null,0]
[-3.8250000000000006,13.511250000000011,0,0,null,0]
[-3.8000000000000007,13.13000000000001,0,0,null,0]
[-3.7750000000000008,12.751250000000013,0,0,null,0]
[-3.7500000000000009,12.375000000000014,0,0,null,0]
[-3.725000000000001,12.001250000000013,0,0,null,0]
[-3.7000000000000011,11.630000000000017,0,0,null,0]
[-3.6750000000000012,11.261250000000018,0,0,null,0]
[-3.6500000000000012,10.895000000000017,0,0,null,0]
[-3.6250000000000013,10.531250000000018,0,0,null,0]
[-3.6000000000000014,10.170000000000019,0,0,null,0]
[-3.5750000000000015,9.8112500000000225,0,0,null,0]
[-3.5500000000000016,9.4550000000000232,0,0,null,0]
[-3.5250000000000017,9.1012500000000252,0,0,null,0]
[-3.5000000000000018,8.7500000000000249,0,0,null,0]
[-3.4750000000000019,8.4012500000000259,0,0,null,0]
[-3.450000000000002,8.0550000000000281,0,0,null,0]
[-3.425000000000002,7.7112500000000281,0,0,null,0]
[-3.4000000000000021,7.3700000000000294,0,0,null,0]
[-3.3750000000000022,7.0312500000000284,0,0,null,0]
[-3.3500000000000023,6.6950000000000323,0,0,null,0]
[-3.3250000000000024,6.3612500000000303,0,0,null,0]
[-3.3000000000000025,6.0300000000000331,0,0,null,0]
[-3.2750000000000026,5.7012500000000337,0,0,null,0]
[-3.2500000000000027,5.3750000000000355,0,0,null,0]
[-3.2250000000000028,5.0512500000000351,0,0,null,0]
[-3.2000000000000028,4.730000000000036,0,0,null,0]
[-3.1750000000000029,4.4112500000000381,0,0,null,0]
[-3.150000000000003,4.0950000000000379,0,0,null,0]
[-3.1250000000000031,3.7812500000000391,0,0,null,0]
[-3.1000000000000032,3.4700000000000379,0,0,null,0]
[-3.0750000000000033,3.1612500000000416,0,0,null,0]
[-3.0500000000000034,2.8550000000000395,0,0,null,0]
[-3.0250000000000035,2.5512500000000422,0,0,null,0]
[-3.0000000000000036,2.2500000000000426,0,0,null,0]
[-2.9750000000000036,1.9512500000000443,0,0,null,0]
[-2.9500000000000037,1.6550000000000438,0,0,null,0]
[-2.9250000000000038,1.3612500000000445,0,0,null,0]
[-2.9000000000000039,1.0700000000000465,0,0,null,0]
[-2.875000000000004,0.78125000000004619,0,0,null,0]
[-2.8500000000000041,0.49500000000004718,0,0,null,0]
[-2.8250000000000042,0.21125000000004768,0,0,null,0]
[-2.8000000000000043,-6.9999999999952323E-2,0,0,null,0]
[-2.7750000000000044,-0.34874999999995104,0,0,null,0]
[-2.7500000000000044,-0.62499999999995026,0,0,null,0]
[-2.7250000000000045,-0.89874999999994998,0,0,null,0]
[-2.7000000000000046,-1.1699999999999502,0,0,null,0]
[-2.6750000000000047,-1.4387499999999491,0,0,null,0]
[-2.6500000000000048,-1.7049999999999486,0,0,null,0]
[-2.6250000000000049,-1.9687499999999485,0,0,null,0]
[-2.600000000000005,-2.2299999999999489,0,0,null,0]
[-2.5750000000000051,-2.4887499999999481,0,0,null,0]
[-2.5500000000000052,-2.7449999999999477,0,0,null,0]
[-2.5250000000000052,-2.9987499999999478,0,0,null,0]
[-2.5000000000000053,-3.2499999999999467,0,0,null,0]
[-2.4750000000000054,-3.4987499999999461,0,0,null,0]
[-2.4500000000000055,-3.7449999999999459,0,0,null,0]
[-2.4250000000000056,-3.9887499999999463,0,0,null,0]
[{"$f":"IF(A73=\"x\",$B$2,A73+step_h)","v":-2.4000000000000057},{"$f":"$B$8*($D$3*(A74-$B$3)^2-($B$5+0.5)*$F$4)","v":-4.2299999999999454},0,{"$f":"D$8*((C74)^2)","v":0},null,0]
[-2.3750000000000058,-4.4687499999999449,{"$f":"$B$6*(8*($A75+$B$7)^3/$F$3^3-12*($A75+$B$7)/$F$3)*EXP(-1*(($A75+$B$7)/$F$3)^2/2)","v":0},0,null,0]
[-2.3500000000000059,-4.704999999999945,0,0,null,0]
[-2.325000000000006,-4.9387499999999438,0,0,null,0]
[-2.300000000000006,-5.1699999999999449,0,0,null,0]
[-2.2750000000000061,-5.3987499999999446,0,0,null,0]
[-2.2500000000000062,-5.6249999999999432,0,0,null,0]
{"$rows_left_out":251}
{"sheet":"Sheet1","index":3,"n_rows":0,"n_cols":0,"rows_kept":0,"cut":false,"hidden":false,"merged":[]}