{"text_format":"1","workbook":"xlsx","n_sheets":3,"sheets":["Rxn","pass","Constant"],"not_rendered":{"charts":0,"images":0,"macros":1,"external_links":0,"defined_names":16,"comments":0,"pivot_tables":0},"unopened":[],"bounds":{"document_bytes":16777216,"sheet_cells":100000,"rows_first":2000,"rows_last":500,"rows_between":2000,"halvings":0,"cell_chars":16384,"cell_head_chars":4096},"cells_cut":0,"cells_raw":0,"read":"whole","date_system":"1900"}

{"sheet":"Rxn","index":0,"n_rows":32,"n_cols":37,"rows_kept":32,"cut":false,"hidden":false,"merged":[[30,34,30,35],[30,36,30,37],[31,34,31,35],[31,36,31,37],[32,34,32,35],[32,36,32,37],[27,34,27,35],[27,36,27,37],[28,34,28,35],[28,36,28,37],[29,34,29,35],[29,36,29,37],[18,22,20,22],[21,22,23,22],[13,34,13,35],[13,36,13,37],[14,34,14,35],[14,36,14,37],[15,34,15,35],[15,36,15,37],[16,34,16,35],[16,36,16,37],[17,34,17,35],[17,36,17,37],[18,34,18,35],[18,36,18,37],[1,8,1,12],[1,0,1,7],[5,4,5,12],[5,0,5,3],[0,0,0,12],[2,6,2,12],[6,13,6,21],[22,4,22,5],[23,4,23,5],[17,6,17,7],[18,6,18,7],[19,6,19,7],[20,6,20,7],[21,6,21,7],[22,6,22,7],[23,6,23,7],[17,4,17,5],[18,4,18,5],[19,4,19,5],[20,4,20,5],[23,9,23,10],[18,11,18,12],[23,11,23,12],[6,0,8,0],[9,0,11,0],[12,0,14,0],[16,0,17,0],[16,1,17,1],[16,2,16,3],[16,4,16,7],[6,4,6,12],[6,2,8,2],[6,1,8,1],[6,3,7,3],[16,9,16,12],[16,8,17,8],[17,11,17,12],[17,9,17,10],[22,9,22,10],[19,11,19,12],[20,11,20,12],[21,11,21,12],[22,11,22,12],[21,4,21,5],[18,9,18,10],[19,9,19,10],[20,9,20,10],[21,9,21,10]]}
["Reaction"]
["Chemistry Department, Kasetsart Kamphaeng Sane",null,null,null,null,null,null,null,"faasptt@ku.ac.th"]
[null,"passwd 1 =","abc","<< type the code ",null,null,"The macro enable is needed"]
[null,"passwd 2 =",null,"<< type the code "]
["Chemical Equation"]
["ดุลสมการโดยเติมชนิด จำนวน และสปส. ของแต่ละสาร",null,null,null,{"$f":"IF(SUMPRODUCT(N9:V9,N9:V9)>0,\"Not Balanced !!!\",IF(COUNT(E10:M15)>0,\"Balanced !\",\"\"))","v":"Balanced !"}]
["Types","n","Chemicals","MW","Atom Types Related to the Reaction",null,null,null,null,null,null,null,null,"Stoichiometry",null,null,null,null,null,null,null,null,null,null,null,null,null,null,null,null,null,null,null,null,"C","H","O"]
[null,null,null,null,"C","H","O",null,null,null,null,null,null,{"$f":"IF(ISTEXT(E8),E8,\"\")","v":"C"},"H","O","","","","","","",null,null,null,null,null,null,null,null,null,null,null,1,3,8]
[null,null,null,"AW>>",{"$f":"IF(ISTEXT(E8),IF(MATCH(E8,AW_id,0),HLOOKUP(\"AW\",AW_tab,MATCH(E8,AW_id,0),0),\"?\"),\"\")","v":12.01078},1.0079469999999999,15.99943,"","","","","","",{"$f":"IF(COUNT(N10:N15)>0,SUM(N10:N12)-SUM(N13:N15),\"\")","v":0},{"$f":"IF(COUNT(O10:O15)>0,SUM(O10:O12)-SUM(O13:O15),\"\")","v":0},0,"","","","","","",null,"Ex1",null,"Ex2",null,"Ex3",null,"Ex4",null,"Ex5",null,5,null,null,2]
["Reactants",1,"C3H8",{"$f":"IF(ISTEXT(C10),IF(COUNT($E10:$M10)>0,SUMPRODUCT($E$9:$M$9,$E10:$M10),\"put #\"),\"\")","v":44.095916000000003},3,8,null,null,null,null,null,null,null,{"$f":"IF(LEN(N$8)>0,$B10*E10,\"\")","v":3},8,0,"","","","","","",null,"C3H8",null,"CH4",null,"KI",null,"KClO3",null,"Cu"]
[null,5,"O2",31.998860000000001,null,null,2,null,null,null,null,null,null,0,0,10,"","","","","","",null,"O2",null,"O2",null,"Pb(NO3)2",null,null,null,"AgNO3",null,4,null,2,1]
[null,null,null,"",null,null,null,null,null,null,null,null,null,0,0,0,"","","","","","",null,null,null,null,null,null,null,null,null,null,null,3,1,null,2]
["Products",4,"H2O",18.015324,null,2,1,null,null,null,null,null,null,0,8,4,"","","","","","",null,"H2O",null,"CO2",null,"PbI2",null,"KCl",null,"Cu(NO3)2"]
[null,3,"CO2",44.009640000000005,1,null,2,null,null,null,null,null,null,3,0,6,"","","","","","",null,"CO2",null,"H2O",null,"KNO3",null,"O2",null,"Ag",null,null,1.5,null,{"$f":"1.5*44.1","v":66.150000000000006}]
[null,null,null,"",null,null,null,null,null,null,null,null,null,0,0,0,"","","","","","",null,null,null,null,null,null,null,null,null,null,null,null,{"$f":"1.5*5","v":7.5},null,{"$f":"7.5*32","v":240}]
["เติมข้อมูลลงในช่อง information พิมพ์ \"x\" ในช่อง limiting (x) สำหรับสารกำหนดปริมาณ"]
["Chemical","Limiting (x)","Information",null,"Answers",null,null,null,"Results","Solutions",null,null,null,null,null,null,null,null,null,null,null,null,null,null,null,null,null,null,null,null,null,null,null,null,{"$f":"4*1.5","v":6},null,{"$f":"6*18.02","v":108.12}]
[null,null,"mol","gram","mol",null,"gram",null,null,"mol",null,"gram",null,"mol","gram","Mol left","gram left","mol","LR","stp1","stp2","stp3",null,null,null,null,null,null,null,null,null,null,null,null,{"$f":"3*1.5","v":4.5},null,{"$f":"4.5*44.01","v":198.04499999999999}]
[{"$f":"IF(AND(LEN(C10)>0,ISNUMBER(B10)),B10&\" \"&C10,\"\")","v":"1 C3H8"},null,1.5,null,1.5,null,66.150000000000006,null,{"$f":"IF(AND(ISNUMBER(N19),rxn_pass_1=rxn_key_1,LEN(A19)>0),IF(AND(ABS((J19-E19)/J19)<0.03,ABS((L19-G19)/L19)<0.03),\"good\",\"x\"),\"\")","v":"good"},{"$f":"IF(LEN($N19)>0,N19,\"\")","v":1.5},null,{"$f":"IF(LEN($A19)>0,O19,\"\")","v":66.143874000000011},null,{"$f":"IF(ISNUMBER(V19),V19,\"\")","v":1.5},{"$f":"IF(AND(ISNUMBER(D10),ISNUMBER(N19)),N19*D10,\"\")","v":66.143874000000011},{"$f":"IF(AND(ISNUMBER(R19),ISNUMBER(N19)),R19-N19,\"\")","v":0},{"$f":"IF(AND(ISNUMBER(D10),ISNUMBER(P19)),P19*D10,\"\")","v":0},{"$f":"IF(ISNUMBER(C19),C19,IF(AND(ISNUMBER(D10),ISNUMBER(D19)),D19/D10,\"\"))","v":1.5},{"$f":"IF(OR(COUNT($R$19:$R$24)=1,AND(ISNUMBER(R19),B19=\"x\")),R19,\"\")","v":1.5},{"$f":"IF(LEN($A19)>0,IF(ISNUMBER(S19),S19,IF(AND(ISNUMBER(S20),ISNUMBER($B10),ISNUMBER($B11)),S20/$B11*$B10,IF(AND(ISNUMBER(S21),ISNUMBER($B12),ISNUMBER($B10)),S21/$B12*$B10,IF(AND(ISNUMBER(S22),ISNUMBER($B13),ISNUMBER($B10)),S22/$B13*$B10,\"x\")))),\"?\")","v":1.5},{"$f":"IF(LEN($A19)>0,IF(T19>0,T19,IF(AND(ISNUMBER(T20),ISNUMBER($B10),ISNUMBER($B11)),T20/$B11*$B10,IF(AND(ISNUMBER(T21),ISNUMBER($B12),ISNUMBER($B10)),T21/$B12*$B10,IF(AND(ISNUMBER(T22),ISNUMBER($B13),ISNUMBER($B10)),T22/$B13*$B10,\"x\")))),\"?\")","v":1.5},{"$f":"IF(LEN($A19)>0,IF(U19>0,U19,IF(AND(ISNUMBER(U20),ISNUMBER($B10),ISNUMBER($B11)),U20/$B11*$B10,IF(AND(ISNUMBER(U21),ISNUMBER($B12),ISNUMBER($B10)),U21/$B12*$B10,IF(AND(ISNUMBER(U22),ISNUMBER($B13),ISNUMBER($B10)),U22/$B13*$B10,\"x\")))),\"?\")","v":1.5},"ทำปฏิกิริยาไปจริง",1.5,null,0.5,null,0.5,null,null,50,null,100]
[{"$f":"IF(AND(LEN(C11)>0,ISNUMBER(B11)),B11&\" \"&C11,\"\")","v":"5 O2"},null,null,null,7.5,null,240,null,{"$f":"IF(AND(ISNUMBER(N20),rxn_pass_1=rxn_key_1,LEN(A20)>0),IF(AND(ABS((J20-E20)/J20)<0.03,ABS((L20-G20)/L20)<0.03),\"good\",\"x\"),\"\")","v":"good"},{"$f":"IF(LEN($N20)>0,N20,\"\")","v":7.5},null,239.99145000000001,null,7.5,239.99145000000001,{"$f":"IF(AND(ISNUMBER(R20),ISNUMBER(N20)),R20-N20,\"\")","v":""},"","","",{"$f":"IF(LEN($A20)>0,IF(ISNUMBER(S20),S20,IF(AND(ISNUMBER(S19),ISNUMBER($B10),ISNUMBER($B11)),S19/$B10*$B11,IF(AND(ISNUMBER(S21),ISNUMBER($B12),ISNUMBER($B11)),S21/$B12*$B11,\"x\"))),\"?\")","v":7.5},{"$f":"IF(LEN($A20)>0,IF(ISNUMBER(T20),T20,IF(AND(ISNUMBER(T19),ISNUMBER($B10),ISNUMBER($B11)),T19/$B10*$B11,IF(AND(ISNUMBER(T21),ISNUMBER($B12),ISNUMBER($B11)),T21/$B12*$B11,\"x\"))),\"?\")","v":7.5},{"$f":"IF(LEN($A20)>0,IF(ISNUMBER(U20),U20,IF(AND(ISNUMBER(U19),ISNUMBER($B10),ISNUMBER($B11)),U19/$B10*$B11,IF(AND(ISNUMBER(U21),ISNUMBER($B12),ISNUMBER($B11)),U21/$B12*$B11,\"x\"))),\"?\")","v":7.5},null,null,null,3,null,null,35,null,50,null,20]
["",null,null,null,null,null,null,null,{"$f":"IF(AND(ISNUMBER(N21),rxn_pass_1=rxn_key_1,LEN(A21)>0),IF(AND(ABS((J21-E21)/J21)<0.03,ABS((L21-G21)/L21)<0.03),\"good\",\"x\"),\"\")","v":""},"",null,"",null,"","","","","","",{"$f":"IF(LEN($A21)>0,IF(ISNUMBER(S21),S21,IF(AND(ISNUMBER(S19),ISNUMBER($B10),ISNUMBER($B12)),S19/$B10*$B12,IF(AND(ISNUMBER(S20),ISNUMBER($B11),ISNUMBER($B12)),S20/$B11*$B12,\"x\"))),\"?\")","v":"?"},{"$f":"IF(LEN($A21)>0,IF(ISNUMBER(T21),T21,IF(AND(ISNUMBER(T19),ISNUMBER($B10),ISNUMBER($B12)),T19/$B10*$B12,IF(AND(ISNUMBER(T20),ISNUMBER($B11),ISNUMBER($B12)),T20/$B11*$B12,\"x\"))),\"?\")","v":"?"},{"$f":"IF(LEN($A21)>0,IF(ISNUMBER(U21),U21,IF(AND(ISNUMBER(U19),ISNUMBER($B10),ISNUMBER($B12)),U19/$B10*$B12,IF(AND(ISNUMBER(U20),ISNUMBER($B11),ISNUMBER($B12)),U20/$B11*$B12,\"x\"))),\"?\")","v":"?"},null,null,null,null,null,null,null,null,null,null,null,null,"C","H","O"]
["4 H2O",null,null,null,6,null,108.12,null,{"$f":"IF(AND(ISNUMBER(N22),rxn_pass_1=rxn_key_1,LEN(A22)>0),IF(AND(ABS((J22-E22)/J22)<0.03,ABS((L22-G22)/L22)<0.03),\"good\",\"x\"),\"\")","v":"good"},6,null,108.091944,null,6,108.091944,{"$f":"IF(ISNUMBER(N22),N22,\"\")","v":6},108.091944,"","",{"$f":"IF(LEN($A22)>0,IF(ISNUMBER(S22),S22,IF(AND(ISNUMBER(S23),ISNUMBER($B13),ISNUMBER($B14)),S23/$B14*$B13,IF(AND(ISNUMBER(S24),ISNUMBER($B15),ISNUMBER($B13)),S24/$B15*$B13,IF(AND(ISNUMBER(S19),ISNUMBER($B10),ISNUMBER($B13)),S19/$B10*$B13,\"x\")))),\"?\")","v":6},{"$f":"IF(LEN($A22)>0,IF(ISNUMBER(T22),T22,IF(AND(ISNUMBER(T23),ISNUMBER($B13),ISNUMBER($B14)),T23/$B14*$B13,IF(AND(ISNUMBER(T24),ISNUMBER($B15),ISNUMBER($B13)),T24/$B15*$B13,IF(AND(ISNUMBER(T19),ISNUMBER($B10),ISNUMBER($B13)),T19/$B10*$B13,\"x\")))),\"?\")","v":6},{"$f":"IF(LEN($A22)>0,IF(ISNUMBER(U22),U22,IF(AND(ISNUMBER(U23),ISNUMBER($B13),ISNUMBER($B14)),U23/$B14*$B13,IF(AND(ISNUMBER(U24),ISNUMBER($B15),ISNUMBER($B13)),U24/$B15*$B13,IF(AND(ISNUMBER(U19),ISNUMBER($B10),ISNUMBER($B13)),U19/$B10*$B13,\"x\")))),\"?\")","v":6},"เกิดขึ้นจากปฏิกิริยา",null,null,null,null,null,null,null,null,null,null,1,1,4]
["3 CO2",null,null,null,4.5,null,198.04499999999999,null,{"$f":"IF(AND(ISNUMBER(N23),rxn_pass_1=rxn_key_1,LEN(A23)>0),IF(AND(ABS((J23-E23)/J23)<0.03,ABS((L23-G23)/L23)<0.03),\"good\",\"x\"),\"\")","v":"good"},4.5,null,198.04338000000001,null,4.5,198.04338000000001,{"$f":"IF(ISNUMBER(N23),N23,\"\")","v":4.5},198.04338000000001,"","",{"$f":"IF(LEN($A23)>0,IF(ISNUMBER(S23),S23,IF(AND(ISNUMBER(S22),ISNUMBER($B13),ISNUMBER($B14)),S22/$B13*$B14,IF(AND(ISNUMBER(S24),ISNUMBER($B15),ISNUMBER($B14)),S24/$B15*$B14,\"x\"))),\"?\")","v":"x"},{"$f":"IF(LEN($A23)>0,IF(ISNUMBER(T23),T23,IF(AND(ISNUMBER(T22),ISNUMBER($B13),ISNUMBER($B14)),T22/$B13*$B14,IF(AND(ISNUMBER(T24),ISNUMBER($B15),ISNUMBER($B14)),T24/$B15*$B14,\"x\"))),\"?\")","v":4.5},{"$f":"IF(LEN($A23)>0,IF(ISNUMBER(U23),U23,IF(AND(ISNUMBER(U22),ISNUMBER($B13),ISNUMBER($B14)),U22/$B13*$B14,IF(AND(ISNUMBER(U24),ISNUMBER($B15),ISNUMBER($B14)),U24/$B15*$B14,\"x\"))),\"?\")","v":4.5},null,null,null,null,null,null,null,null,null,null,30,2,null,null,2]
["",null,null,null,null,null,null,null,{"$f":"IF(AND(ISNUMBER(N24),rxn_pass_1=rxn_key_1,LEN(A24)>0),IF(AND(ABS((J24-E24)/J24)<0.03,ABS((L24-G24)/L24)<0.03),\"good\",\"x\"),\"\")","v":""},"",null,"",null,"","","","","","",{"$f":"IF(LEN($A24)>0,IF(ISNUMBER(S24),S24,IF(AND(ISNUMBER(S22),ISNUMBER($B13),ISNUMBER($B15)),S22/$B13*$B15,IF(AND(ISNUMBER(S23),ISNUMBER($B14),ISNUMBER($B15)),S23/$B14*$B15,\"x\"))),\"?\")","v":"?"},{"$f":"IF(LEN($A24)>0,IF(ISNUMBER(T24),T24,IF(AND(ISNUMBER(T22),ISNUMBER($B13),ISNUMBER($B15)),T22/$B13*$B15,IF(AND(ISNUMBER(T23),ISNUMBER($B14),ISNUMBER($B15)),T23/$B14*$B15,\"x\"))),\"?\")","v":"?"},{"$f":"IF(LEN($A24)>0,IF(ISNUMBER(U24),U24,IF(AND(ISNUMBER(U22),ISNUMBER($B13),ISNUMBER($B15)),U22/$B13*$B15,IF(AND(ISNUMBER(U23),ISNUMBER($B14),ISNUMBER($B15)),U23/$B14*$B15,\"x\"))),\"?\")","v":"?"}]
[null,null,"ทำปฏิกิริยาได้ผลิตภัณฑ์กี่กรัม?",null,null,null,null,null,null,null,null,null,null,null,null,null,null,null,null,null,null,null,null,"ทำปฏิกิริยาได้ผลิตภัณฑ์กี่กรัม?",null,"สารใดเป็นสารกำหนดปริมาณ?",null,"สารใดเป็นสารกำหนดปริมาณ?",null,"สารใดเป็นสารกำหนดปริมาณ?",null,"ต้องการผลิตภัณฑ์ Ag 30 g ได้หรือไม่?",null,1,1,null,2]
[null,"ñ Red filled cell means the chemical runs out.",null,null,null,null,null,null,null,null,null,null,null,null,null,null,null,null,null,null,null,null,null,null,null,null,null,null,null,null,null,null,null,2,null,2,1]
[]
[null,null,null,null,null,null,null,null,null,null,null,null,null,null,null,null,null,null,null,null,null,null,null,null,null,null,null,null,null,null,null,null,null,"x",0.5,null,{"$f":"0.5*16.04","v":8.02}]
[null,null,null,null,null,null,null,null,null,null,null,null,null,null,null,null,null,null,null,null,null,null,null,null,null,null,null,null,null,null,null,null,null,null,{"$f":"0.5*2","v":1},null,{"$f":"1*32","v":32}]
[]
[null,null,null,null,null,null,null,null,null,null,null,null,null,null,null,null,null,null,null,null,null,null,null,null,null,null,null,null,null,null,null,null,null,null,{"$f":"1*0.5","v":0.5},null,{"$f":"0.5*44.01","v":22.004999999999999}]
[null,null,null,null,null,null,null,null,null,null,null,null,null,null,null,null,null,null,null,null,null,null,null,null,null,null,null,null,null,null,null,null,null,null,{"$f":"2*0.5","v":1},null,20]

{"sheet":"pass","index":1,"n_rows":13,"n_cols":6,"rows_kept":13,"cut":false,"hidden":false,"merged":[]}
[]
[]
[]
[]
[]
[]
[]
[]
[]
[]
[null,null,null,null,"Solid","Reaction"]
[null,null,null,"key1","abc","abc"]
[null,null,null,"key2","Kasetsart","Kasetsart"]

{"sheet":"Constant","index":2,"n_rows":129,"n_cols":3,"rows_kept":129,"cut":false,"hidden":false,"merged":[]}
[]
[]
["NA",6.02E+23]
["R_latm",8.2000000000000003E-2]
["R_j",8.3140000000000001]
[]
[]
[]
[]
[]
[]
["Element","Name","AW"]
["H","Hydrogen",1.0079469999999999]
["He","Helium",4.0026022000000001]
["Li","Lithium",6.9412000000000003]
["Be","Beryllium",9.0121822999999992]
["B","Boron",10.8117]
["C","Carbon",12.01078]
["N","Nitrogen",14.00672]
["O","Oxygen",15.99943]
["F","Fluorine",18.998403249999999]
["Ne","Neon",20.179760000000002]
["Na","Sodium",22.989769282000001]
["Mg","Magnesium",24.305060000000001]
["Al","Aluminium",26.98153868]
["Si","Silicon",28.085529999999999]
["P","Phosphorus",30.973762199999999]
["S","Sulfur",32.0655]
["Cl","Chlorine",35.453200000000002]
["Ar","Argon",39.948099999999997]
["K","Potassium",39.098309999999998]
["Ca","Calcium",40.078400000000002]
["Sc","Scandium",44.955912599999998]
["Ti","Titanium",47.867100000000001]
["V","Vanadium",50.941510000000001]
["Cr","Chromium",51.996160000000003]
["Mn","Manganese",54.938045500000001]
["Fe","Iron",55.845199999999998]
["Co","Cobalt",58.933195499999997]
["Ni","Nickel",58.693420000000003]
["Cu","Copper",63.546300000000002]
["Zn","Zinc",65.409400000000005]
["Ga","Gallium",69.723100000000002]
["Ge","Germanium",72.641000000000005]
["As","Arsenic",74.921601999999993]
["Se","Selenium",78.962999999999994]
["Br","Bromine",79.9041]
["Kr","Krypton",83.798199999999994]
["Rb","Rubidium",85.467830000000006]
["Sr","Strontium",87.620999999999995]
["Y","Yttrium",88.905851999999996]
["Zr","Zirconium",91.224199999999996]
["Nb","Niobium",92.906381999999994]
["Mo","Molybdenum",95.941999999999993]
["Tc","Technetium",98]
["Ru","Ruthenium",101.072]
["Rh","Rhodium",102.905502]
["Pd","Palladium",106.42100000000001]
["Ag","Silver",107.86821999999999]
["Cd","Cadmium",112.4118]
["In","Indium",114.81829999999999]
["Sn","Tin",118.7107]
["Sb","Antimony",121.76009999999999]
["Te","Tellurium",127.60299999999999]
["I","Iodine",126.904473]
["Xe","Xenon",131.2936]
["Cs","Caesium",132.90545191999999]
["Ba","Barium",137.32769999999999]
["La","Lanthanum",138.90547699999999]
["Ce","Cerium",140.11609999999999]
["Pr","Praseodymium",140.90765200000001]
["Nd","Neodymium",144.2423]
["Pm","Promethium",145]
["Sm","Samarium",150.36199999999999]
["Eu","Europium",151.9641]
["Gd","Gadolinium",157.25299999999999]
["Tb","Terbium",158.925352]
["Dy","Dysprosium",162.5001]
["Ho","Holmium",164.93032199999999]
["Er","Erbium",167.2593]
["Tm","Thulium",168.934212]
["Yb","Ytterbium",173.04300000000001]
["Lu","Lutetium",174.96709999999999]
["Hf","Hafnium",178.49199999999999]
["Ta","Tantalum",180.94788199999999]
["W","Tungsten",183.84100000000001]
["Re","Rhenium",186.2071]
["Os","Osmium",190.233]
["Ir","Iridium",192.21729999999999]
["Pt","Platinum",195.0849]
["Au","Gold",196.9665694]
["Hg","Mercury",200.59200000000001]
["Tl","Thallium",204.38332]
["Pb","Lead",207.21]
["Bi","Bismuth",208.980401]
["Po","Polonium",209]
["At","Astatine",210]
["Rn","Radon",222]
["Fr","Francium",223]
["Ra","Radium",226]
["Ac","Actinium",227]
["Th","Thorium",232.038062]
["Pa","Protactinium",231.03588199999999]
["U","Uranium",238.02891299999999]
["Np","Neptunium",237]
["Pu","Plutonium",244]
["Am","Americium",243]
["Cm","Curium",247]
["Bk","Berkelium",247]
["Cf","Californium",251]
["Es","Einsteinium",252]
["Fm","Fermium",257]
["Md","Mendelevium",258]
["No","Nobelium",259]
["Lr","Lawrencium",262]
["Rf","Rutherfordium",261]
["Db","Dubnium",262]
["Sg","Seaborgium",266]
["Bh","Bohrium",264]
["Hs","Hassium",277]
["Mt","Meitnerium",268]
["Ds","Darmstadtium",281]
["Rg","Roentgenium",272]
["Uub","Ununbium",285]
["Uut","Ununtrium",284]
["Uuq","Ununquadium",289]
["Uup","Ununpentium",288]
["Uuh","Ununhexium",291]
["Uuo","Ununoctium",294]