{"text_format":"1","workbook":"xlsx","n_sheets":3,"sheets":["Solid","pass","Constant"],"not_rendered":{"charts":0,"images":2,"macros":1,"external_links":0,"defined_names":17,"comments":0,"pivot_tables":0},"unopened":[],"bounds":{"document_bytes":16777216,"sheet_cells":100000,"rows_first":2000,"rows_last":500,"rows_between":2000,"halvings":0,"cell_chars":16384,"cell_head_chars":4096},"cells_cut":0,"cells_raw":0,"read":"whole","date_system":"1900"}

{"sheet":"Solid","index":0,"n_rows":25,"n_cols":19,"rows_kept":25,"cut":false,"hidden":false,"merged":[[0,0,0,2],[8,1,8,2],[1,0,1,2]]}
["Solid"]
["Chemistry Department, Kasetsart, Kamphaeng Saen"]
["Cubic Type","atom/UC","a-Factor"]
["SCC",1,2]
["BCC",2,{"$f":"ROUND(4/SQRT(3),3)","v":2.3090000000000002}]
["FCC",4,{"$f":"ROUND(SQRT(8),3)","v":2.8279999999999998}]
[]
["passwd (1,2) =","kps"]
[null,"faasptt@ku.ac.th"]
["เติมข้อมูลที่ทราบจากโจทย์ในคอลัมน์ Information หรือกดปุ่มเลือกตัวอย่าง จากนั้นเติมคำตอบที่หาได้ในคอลัมน์ Answer"]
["#step","Value","Information","Step1","Step2","Step3","Step4","Step5","Solution","Answer","Result","Solution","คำอธิบาย","Ex1","Ex2","Ex3","Ex4","Ex5","Ex6"]
[{"$f":"IF(COUNTIF(D12:I12,\"x\")<6,COUNTIF(D12:I12,\"x\")+1&\" step\",\"\")","v":""},"Cubic Type",null,{"$f":"IF(LEN(C12)>1,C12,IF(ISNUMBER(MATCH(C13,ID_at,0)),HLOOKUP($B$12,Cubic_Type,MATCH(C13,ID_at,0),0),IF(ISNUMBER(MATCH(ROUND(C14,3),id_Factor,0)),HLOOKUP($B$12,Cubic_Type,MATCH(ROUND(C14,3),id_Factor,0),0),\"x\")))","v":"x"},"x","x","x","x","x",null,{"$f":"IF(AND(LEN(I12)>0,LEN(J12)>0,Solid_pass_1=solid_key1),IF(I12=J12,\"good\", \"wrong\"),\"\")","v":""},{"$f":"IF(AND(Solid_pass_1=solid_key1,solid_pass_2=solid_key2,LEN(I12)>0,LEN(C12)=0),I12,\"\")","v":""},"ชนิดของเซล","fcc","bcc","fcc","fcc"]
[{"$f":"IF(AND(6-COUNT(C13:H13)>0,6-COUNT(C13:H13)<6),6-COUNT(C13:H13)&\" step\",\"\")","v":""},"atom/UC",null,{"$f":"IF(ISNUMBER(C13),C13,IF(ISNUMBER(MATCH(C$12,ID_Type,0)),HLOOKUP($B13,Cubic_Type,MATCH(C$12,ID_Type,0),0),IF(AND(ISNUMBER(C18),ISNUMBER(C17)),ROUND(Navo/(C18/C17),0),IF(ISNUMBER(MATCH($C$14,id_Factor,0)),HLOOKUP($B13,Cubic_Type,MATCH($C$14,id_Factor,0),0),IF(ISNUMBER(C22),Navo/C22,IF(AND(ISNUMBER(C19),ISNUMBER(C21)),Navo/(C19/C21),\"x\"))))))","v":"x"},"x","x","x","x","x",null,{"$f":"IF(AND(ISNUMBER(I13),ISNUMBER(J13),Solid_pass_1=solid_key1),IF(ABS(J13-I13)/ABS(J13)<0.05,\"good\", \"wrong\"),\"\")","v":""},"","จำนวนอะตอมต่อเซล"]
[{"$f":"IF(AND(6-COUNT(C14:H14)>0,6-COUNT(C14:H14)<6),6-COUNT(C14:H14)&\" step\",\"\")","v":""},"a-Factor",null,{"$f":"IF(ISNUMBER(C14),C14,IF(ISNUMBER(MATCH($C$12,ID_Type,0)),HLOOKUP($B14,Cubic_Type,MATCH($C$12,ID_Type,0),0),IF(ISNUMBER(C13),HLOOKUP($B14,Cubic_Type,MATCH(C13,ID_at,0),0),IF(AND(ISNUMBER(C16),ISNUMBER(C15)),C16/C15,\"x\"))))","v":"x"},"x","x","x","x","x",null,"","","แฟคเตอร์หา a จาก r"]
["","Radius (cm)",null,{"$f":"IF(ISNUMBER(C15),C15,IF(AND(ISNUMBER(C16),ISNUMBER(C14)),C16/C14,\"x\"))","v":"x"},{"$f":"IF(ISNUMBER(D15),D15,IF(AND(ISNUMBER(D16),ISNUMBER(D14)),D16/D14,\"x\"))","v":"x"},"x","x","x","x",null,"","","รัศมีอะตอม (cm)",{"$f":"0.0000000125","v":1.2499999999999999E-8}]
["","a (cm)",null,{"$f":"IF(ISNUMBER(C16),C16,IF(AND(ISNUMBER(C14),ISNUMBER(C15)),C14*C15,IF(ISNUMBER(C17),POWER(C17,1/3),\"x\")))","v":"x"},"x","x","x","x","x",null,"","","ความยาวขอบเซล (cm)",null,null,5.5600000000000002E-8,1.24E-8,2.8699999999999999E-8,4.0800000000000001E-8]
["","Vuc (cm3/UC)",null,{"$f":"IF(ISNUMBER(C17),C17,IF(ISNUMBER(C16),C16^3,IF(AND(ISNUMBER(C23),ISNUMBER(C21)),C21/C23,IF(AND(ISNUMBER(C18),ISNUMBER(C13)),C18/Navo*C13,\"x\"))))","v":"x"},"x","x","x","x","x",null,"","","ปริมาตรเซล (cm3)"]
["","Vmol (cm3/mol)",null,{"$f":"IF(ISNUMBER(C18),C18,IF(AND(ISNUMBER(C23),ISNUMBER(C19)),C19/C23,IF(AND(ISNUMBER(C17),ISNUMBER(C13)),Navo/C13*C17,\"x\")))","v":"x"},"x","x","x","x","x",null,"","","ปริมาตรของสาร1โมล (cm3)",null,null,null,null,7.0960000000000001]
["","AW (g/mol)",null,{"$f":"IF(ISNUMBER(C19),C19,IF(ISNUMBER(C20),C20*Navo,IF(AND(ISNUMBER(C18),ISNUMBER(C23)),C23*C18,\"x\")))","v":"x"},"x","x","x","x","x",null,"","","น้ำหนักสูตร (อะตอม/โมเลกุล)",26.98,183.85,null,58.69,55.844999999999999,196.97]
["","Weight (g/atom)",null,{"$f":"IF(ISNUMBER(C20),C20,IF(ISNUMBER(C19),C19/Navo,IF(AND(ISNUMBER(C21),ISNUMBER(C13)),C21/C13,\"x\")))","v":"x"},"x","x","x","x","x",null,"","","น้ำหนักสาร 1 อะตอม"]
["","Weight (g/UC)",null,{"$f":"IF(ISNUMBER(C21),C21,IF(AND(ISNUMBER(C19),ISNUMBER(C13)),C19*C13/Navo,IF(AND(ISNUMBER(C23),ISNUMBER(C17)),C17*C23,\"x\")))","v":"x"},"x","x","x","x","x",null,"","","น้ำหนักสาร 1 เซล"]
["","#UC (UC/mol)",null,{"$f":"IF(ISNUMBER(C22),C22,IF(ISNUMBER(C13),Navo/C13,IF(AND(ISNUMBER(C18),ISNUMBER(C17)),C18/C17,IF(AND(ISNUMBER(C19),ISNUMBER(C21)),C19/C21,\"x\"))))","v":"x"},"x","x","x","x","x",null,{"$f":"IF(AND(ISNUMBER(I22),ISNUMBER(J22),Solid_pass_1=solid_key1),IF(ABS(J22-I22)/ABS(J22)<0.05,\"good\", \"wrong\"),\"\")","v":""},{"$f":"IF(AND(Solid_pass_1=solid_key1,solid_pass_2=solid_key2,LEN(I22)>0,LEN(C22)=0),I22,\"\")","v":""},"จำนวนเซลของสาร 1 โมล"]
["","Density (g/cm3)",null,{"$f":"IF(ISNUMBER(C23),C23,IF(AND(ISNUMBER(C19),ISNUMBER(C18)),C19/C18,IF(AND(ISNUMBER(C21),ISNUMBER(C17)),C21/C17,\"x\")))","v":"x"},{"$f":"IF(ISNUMBER(D23),D23,IF(AND(ISNUMBER(D19),ISNUMBER(D18)),D19/D18,IF(AND(ISNUMBER(D21),ISNUMBER(D17)),D21/D17,\"x\")))","v":"x"},"x","x","x","x",null,"","","ความหนาแน่น (d=m/V)",null,19.350000000000001,1.5489999999999999,null,null,19.32]
[null,null,null,null,null,null,null,null,null,null,null,null,null,"อลูมิเนียม รัศมีอะตอม 125 pm เป็นผลึกแบบ fcc จงหาความยาวตามขอบ","ทังสเตนมี d= 19.35 g/mL น้ำหนักอะตอม 183.85 g/mol ผลึกแบบ bcc จงหาความยาวขอบเซล","แคลเซียมผลึกแบบ fcc มี a = 0.556 nm ความหนาแน่นเท่ากับ 1.549 g/mL จงหาน้ำหนักอะตอม","นิเกิลผลึกแบบ fcc รัศมีอะตอม 0.124 nm จงหาความหนาแน่น","เหล็ก มีความยาวขอบเซล 287 pm เหล็ก 1 โมลมีปริมาตร 7.096 mL เป็นผลึกแบบใด","ทองคำมีความหนาแน่น 19.32 g/mL และมีความยาวขอบเซลเท่ากับ 4.08 angstrom เป็นผลึกชนิดใด"]
["หมายเหตุ ถ้าต้องการกดปุ่มเลือกตัวอย่าง ต้อง enable macro ก่อน"]

{"sheet":"pass","index":1,"n_rows":13,"n_cols":6,"rows_kept":13,"cut":false,"hidden":false,"merged":[]}
[]
[]
[]
[]
[]
[]
[]
[]
[]
[]
[null,null,null,null,"Solid","Reaction"]
[null,null,null,"key1","kps","abc"]
[null,null,null,"key2","ptt","kasetsart"]

{"sheet":"Constant","index":2,"n_rows":129,"n_cols":3,"rows_kept":129,"cut":false,"hidden":false,"merged":[]}
[]
[]
["NA",6.02E+23]
["R_latm",8.2000000000000003E-2]
["R_j",8.3140000000000001]
[]
[]
[]
[]
[]
[]
["Element","Name","AW"]
["H","Hydrogen",1.0079469999999999]
["He","Helium",4.0026022000000001]
["Li","Lithium",6.9412000000000003]
["Be","Beryllium",9.0121822999999992]
["B","Boron",10.8117]
["C","Carbon",12.01078]
["N","Nitrogen",14.00672]
["O","Oxygen",15.99943]
["F","Fluorine",18.998403249999999]
["Ne","Neon",20.179760000000002]
["Na","Sodium",22.989769282000001]
["Mg","Magnesium",24.305060000000001]
["Al","Aluminium",26.98153868]
["Si","Silicon",28.085529999999999]
["P","Phosphorus",30.973762199999999]
["S","Sulfur",32.0655]
["Cl","Chlorine",35.453200000000002]
["Ar","Argon",39.948099999999997]
["K","Potassium",39.098309999999998]
["Ca","Calcium",40.078400000000002]
["Sc","Scandium",44.955912599999998]
["Ti","Titanium",47.867100000000001]
["V","Vanadium",50.941510000000001]
["Cr","Chromium",51.996160000000003]
["Mn","Manganese",54.938045500000001]
["Fe","Iron",55.845199999999998]
["Co","Cobalt",58.933195499999997]
["Ni","Nickel",58.693420000000003]
["Cu","Copper",63.546300000000002]
["Zn","Zinc",65.409400000000005]
["Ga","Gallium",69.723100000000002]
["Ge","Germanium",72.641000000000005]
["As","Arsenic",74.921601999999993]
["Se","Selenium",78.962999999999994]
["Br","Bromine",79.9041]
["Kr","Krypton",83.798199999999994]
["Rb","Rubidium",85.467830000000006]
["Sr","Strontium",87.620999999999995]
["Y","Yttrium",88.905851999999996]
["Zr","Zirconium",91.224199999999996]
["Nb","Niobium",92.906381999999994]
["Mo","Molybdenum",95.941999999999993]
["Tc","Technetium",98]
["Ru","Ruthenium",101.072]
["Rh","Rhodium",102.905502]
["Pd","Palladium",106.42100000000001]
["Ag","Silver",107.86821999999999]
["Cd","Cadmium",112.4118]
["In","Indium",114.81829999999999]
["Sn","Tin",118.7107]
["Sb","Antimony",121.76009999999999]
["Te","Tellurium",127.60299999999999]
["I","Iodine",126.904473]
["Xe","Xenon",131.2936]
["Cs","Caesium",132.90545191999999]
["Ba","Barium",137.32769999999999]
["La","Lanthanum",138.90547699999999]
["Ce","Cerium",140.11609999999999]
["Pr","Praseodymium",140.90765200000001]
["Nd","Neodymium",144.2423]
["Pm","Promethium",145]
["Sm","Samarium",150.36199999999999]
["Eu","Europium",151.9641]
["Gd","Gadolinium",157.25299999999999]
["Tb","Terbium",158.925352]
["Dy","Dysprosium",162.5001]
["Ho","Holmium",164.93032199999999]
["Er","Erbium",167.2593]
["Tm","Thulium",168.934212]
["Yb","Ytterbium",173.04300000000001]
["Lu","Lutetium",174.96709999999999]
["Hf","Hafnium",178.49199999999999]
["Ta","Tantalum",180.94788199999999]
["W","Tungsten",183.84100000000001]
["Re","Rhenium",186.2071]
["Os","Osmium",190.233]
["Ir","Iridium",192.21729999999999]
["Pt","Platinum",195.0849]
["Au","Gold",196.9665694]
["Hg","Mercury",200.59200000000001]
["Tl","Thallium",204.38332]
["Pb","Lead",207.21]
["Bi","Bismuth",208.980401]
["Po","Polonium",209]
["At","Astatine",210]
["Rn","Radon",222]
["Fr","Francium",223]
["Ra","Radium",226]
["Ac","Actinium",227]
["Th","Thorium",232.038062]
["Pa","Protactinium",231.03588199999999]
["U","Uranium",238.02891299999999]
["Np","Neptunium",237]
["Pu","Plutonium",244]
["Am","Americium",243]
["Cm","Curium",247]
["Bk","Berkelium",247]
["Cf","Californium",251]
["Es","Einsteinium",252]
["Fm","Fermium",257]
["Md","Mendelevium",258]
["No","Nobelium",259]
["Lr","Lawrencium",262]
["Rf","Rutherfordium",261]
["Db","Dubnium",262]
["Sg","Seaborgium",266]
["Bh","Bohrium",264]
["Hs","Hassium",277]
["Mt","Meitnerium",268]
["Ds","Darmstadtium",281]
["Rg","Roentgenium",272]
["Uub","Ununbium",285]
["Uut","Ununtrium",284]
["Uuq","Ununquadium",289]
["Uup","Ununpentium",288]
["Uuh","Ununhexium",291]
["Uuo","Ununoctium",294]